Target
Leukotriene B4 receptor 1/2
Ligand
BDBM50215861
Substrate
Meas. Tech.
ChEMBL_98510 (CHEMBL709172)
IC50
22.0±n/a nM
Citation
 Reiter, LAKoch, KPiscopio, ADShowell, HJAlpert, RBiggers, MSChambers, RJConklyn, MJCooper, KCortina, SRDibrino, JNDominy, BWFarrell, CAHingorani, GPMartinelli, GJRamchandani, MWright, KF trans-3-Benzyl-4-hydroxy-7-chromanylbenzoic acid derivatives as antagonists of the leukotriene B4 (LTB4) receptor. Bioorg Med Chem Lett 8:1781-6 (1998)  
Target
Name:
Leukotriene B4 receptor 1/2
Synonyms:
Leukotriene B4 receptor
Type:
Mol. Mass.:
Description:
ASSAY_ID of ChEMBL is 88360
Components:
This complex has 2 components.
Component 1
Name:
Leukotriene B4 receptor 2
Synonyms:
BLT2R LT4R2_HUMAN LTB4-R 2 LTB4R2 Leukotriene B4 Leukotriene B4 receptor Leukotriene B4 receptor BLT2 Seven transmembrane receptor BLTR2
Type:
Enzyme Catalytic Domain
Mol. Mass.:
37964.86
Organism:
Homo sapiens (Human)
Description:
Leukotriene 2 0 HUMAN::Q9NPC1
Residue:
358
  
Component 2
Name:
Leukotriene B4 receptor 1
Synonyms:
BLT BLTR Chemoattractant receptor-like 1 GPR16 LTB4-R 1 Leukotriene B4 R1 Leukotriene B4 receptor 1 P2Y purinoceptor 7 | P2Y7
Type:
Enzyme Catalytic Domain
Mol. Mass.:
37582.68
Organism:
Homo sapiens (Human)
Description:
Q15722
Residue:
352
  
Inhibitor
Name:
BDBM50215861
Synonyms:
CHEMBL298724
Type:
Small organic molecule
Emp. Form.:
C23H19FO4
Mol. Mass.:
378.393
SMILES:
O[C@@H]1[C@@H](Cc2ccccc2)COc2cc(ccc12)-c1cccc(F)c1C(O)=O
: