Target
D(3) dopamine receptor
Ligand
BDBM85672
Substrate
Meas. Tech.
ChEMBL_58783 (CHEMBL666970)
Ki
0.316228±n/a nM
Citation
 Dubuffet, TNewman-Tancredi, ACussac, DAudinot, VLoutz, AMillan, MJLavielle, G Novel benzopyrano[3,4-c]pyrrole derivatives as potent and selective dopamine D3 receptor antagonist. Bioorg Med Chem Lett 9:2059-64 (1999)  
Target
Name:
D(3) dopamine receptor
Synonyms:
DOPAMINE D3 DRD3_HUMAN Dopamine D3 receptor (D3) Dopamine receptor Dopamine receptor D3
Type:
Mol. Mass.:
44243.43
Organism:
Homo sapiens (Human)
Description:
Residue:
400
  
Inhibitor
Name:
BDBM85672
Synonyms:
S33084
Type:
Small organic molecule
Emp. Form.:
C29H29N3O2
Mol. Mass.:
451.5595
SMILES:
O=C(NCCCCN1C[C@@H]2COc3ccc(cc3[C@H]2C1)C#N)c1ccc(cc1)-c1ccccc1
: