Target
Neurotensin receptor type 1/2
Ligand
BDBM50086639
Substrate
Meas. Tech.
ChEMBL_144288 (CHEMBL754789)
Ki
28±n/a nM
Citation
 Lundquist, JTDix, TA Preparation and receptor binding affinities of cyclic C-terminal neurotensin (8-13) and (9-13) analogues. Bioorg Med Chem Lett 9:2579-82 (1999)  
Target
Name:
Neurotensin receptor type 1/2
Synonyms:
Neurotensin receptor
Type:
Mol. Mass.:
Description:
ASSAY_ID of ChEMBL is 144284
Components:
This complex has 2 components.
Component 1
Name:
Neurotensin receptor type 2
Synonyms:
Levocabastine-sensitive neurotensin receptor NTR2 NTR2_HUMAN Neurotensin receptor Neurotensin receptor type 2
Type:
PROTEIN
Mol. Mass.:
45404.76
Organism:
Homo sapiens (Human)
Description:
ChEMBL_1281495
Residue:
410
  
Component 2
Name:
Neurotensin receptor type 1
Synonyms:
Dopamine receptor D2L/neurotensin receptor NTS1 NTRR Neurotensin receptor 1 | neurotensin receptor type 1
Type:
PROTEIN
Mol. Mass.:
46278.89
Organism:
Homo sapiens (Human)
Description:
ChEMBL_1453811
Residue:
418
  
Inhibitor
Name:
BDBM50086639
Synonyms:
(S)-2-{(2S,3S)-2-[(S)-2-{[(S)-1-((S)-2-Amino-5-guanidino-pentanoyl)-pyrrolidine-2-carbonyl]-amino}-3-(4-hydroxy-phenyl)-propionylamino]-3-methyl-pentanoylamino}-4-methyl-pentanoic acid Arg-Pro-Tyr-Ile-Leu | CHEMBL48981
Type:
Small organic molecule
Emp. Form.:
C32H52N8O7
Mol. Mass.:
660.8047
SMILES:
CC[C@H](C)[C@H](NC(=O)[C@H](Cc1ccc(O)cc1)NC(=O)[C@@H]1CCCN1C(=O)[C@@H](N)CCCNC(N)=N)C(=O)N[C@@H](CC(C)C)C(O)=O
: