Target
D(2) dopamine receptor
Ligand
BDBM50217155
Substrate
Meas. Tech.
ChEMBL_60391 (CHEMBL672227)
Ki
200±n/a nM
Citation
 Austin, NEAvenell, KYBoyfield, IBranch, CLColdwell, MCHadley, MSJeffrey, PJohns, AJohnson, CNNash, DJRiley, GJSmith, SAStacey, RCStemp, GThewlis, KMVong, AK Novel 1,2,3,4-tetrahydroisoquinolines with high affinity and selectivity for the dopamine D3 receptor. Bioorg Med Chem Lett 9:179-84 (1999)  
Target
Name:
D(2) dopamine receptor
Synonyms:
D(2) dopamine receptor DOPAMINE D2 Long DRD2 Dopamine D2 receptor Dopamine D2 receptor (D2R) Dopamine2-like | d2
Type:
Cell-surface receptors
Mol. Mass.:
50647.10
Organism:
Homo sapiens (Human)
Description:
P14416
Residue:
443
  
Inhibitor
Name:
BDBM50217155
Synonyms:
CHEMBL291545
Type:
Small organic molecule
Emp. Form.:
C25H26F3N3O4S
Mol. Mass.:
521.552
SMILES:
FC(F)(F)S(=O)(=O)Oc1ccc2CCN(CCCCNC(=O)\C=C\c3ccc4[nH]ccc4c3)Cc2c1
: