Target
D(3) dopamine receptor
Ligand
BDBM50217167
Substrate
Meas. Tech.
ChEMBL_62457 (CHEMBL679229)
Ki
126±n/a nM
Citation
 Austin, NEAvenell, KYBoyfield, IBranch, CLColdwell, MCHadley, MSJeffrey, PJohns, AJohnson, CNNash, DJRiley, GJSmith, SAStacey, RCStemp, GThewlis, KMVong, AK Novel 1,2,3,4-tetrahydroisoquinolines with high affinity and selectivity for the dopamine D3 receptor. Bioorg Med Chem Lett 9:179-84 (1999)  
Target
Name:
D(3) dopamine receptor
Synonyms:
DOPAMINE D3 DRD3_HUMAN Dopamine D3 receptor (D3) Dopamine receptor Dopamine receptor D3
Type:
Mol. Mass.:
44243.43
Organism:
Homo sapiens (Human)
Description:
Residue:
400
  
Inhibitor
Name:
BDBM50217167
Synonyms:
CHEMBL52770
Type:
Small organic molecule
Emp. Form.:
C27H27F3N2O4S
Mol. Mass.:
532.574
SMILES:
FC(F)(F)S(=O)(=O)Oc1ccc2CCN(CCCCNC(=O)c3cccc(c3)-c3ccccc3)Cc2c1
: