Target
D(3) dopamine receptor
Ligand
BDBM50217175
Substrate
Meas. Tech.
ChEMBL_62457 (CHEMBL679229)
Ki
4.0±n/a nM
Citation
 Austin, NEAvenell, KYBoyfield, IBranch, CLColdwell, MCHadley, MSJeffrey, PJohns, AJohnson, CNNash, DJRiley, GJSmith, SAStacey, RCStemp, GThewlis, KMVong, AK Novel 1,2,3,4-tetrahydroisoquinolines with high affinity and selectivity for the dopamine D3 receptor. Bioorg Med Chem Lett 9:179-84 (1999)  
Target
Name:
D(3) dopamine receptor
Synonyms:
DOPAMINE D3 DRD3_HUMAN Dopamine D3 receptor (D3) Dopamine receptor Dopamine receptor D3
Type:
Mol. Mass.:
44243.43
Organism:
Homo sapiens (Human)
Description:
Residue:
400
  
Inhibitor
Name:
BDBM50217175
Synonyms:
CHEMBL53351
Type:
Small organic molecule
Emp. Form.:
C25H30F3N3O4S
Mol. Mass.:
525.584
SMILES:
CN(C)c1ccc(\C=C\C(=O)NCCCCN2CCc3ccc(OS(=O)(=O)C(F)(F)F)cc3C2)cc1
: