Target
Estrogen receptor beta
Ligand
BDBM50217538
Substrate
Meas. Tech.
ChEMBL_101112 (CHEMBL710208)
IC50
0.520000±n/a nM
Citation
 Schmid, CRGlasebrook, ALMisner, JWStephenson, GA Synthesis and biological activity of trans-2,3-dihydroraloxifene. Bioorg Med Chem Lett 9:1137-40 (1999)  
Target
Name:
Estrogen receptor beta
Synonyms:
Estrogen receptor
Type:
Mol. Mass.:
Description:
ASSAY_ID of ChEMBL is 99778
Components:
This complex has 2 components.
Component 1
Name:
Estrogen receptor beta
Synonyms:
ER-beta ESR2_HUMAN Estradiol receptor beta (ERβ) Estrogen receptor (ER beta) Estrogen receptor beta (ER beta) NR3A2 estrogen beta
Type:
Protein
Mol. Mass.:
59238.43
Organism:
Homo sapiens (Human)
Description:
Q92731
Residue:
530
  
Component 2
Name:
Estrogen receptor
Synonyms:
ER ESR ESR1_HUMAN Estrogen receptor Estrogen receptor (ER-alpha) Estrogen receptor alpha (ER) Nuclear receptor subfamily 3 group A member 1
Type:
Protein
Mol. Mass.:
66230.44
Organism:
Homo sapiens (Human)
Description:
P03372
Residue:
595
  
Inhibitor
Name:
BDBM50217538
Synonyms:
DIHYDRORALOXIFENE
Type:
Small organic molecule
Emp. Form.:
C28H29NO4S
Mol. Mass.:
475.599
SMILES:
Oc1ccc(cc1)[C@H]1Sc2cc(O)ccc2[C@@H]1C(=O)c1ccc(OCCN2CCCCC2)cc1
: