Target
5-hydroxytryptamine receptor 2A
Ligand
BDBM50218203
Substrate
Meas. Tech.
ChEMBL_2530 (CHEMBL616880)
Ki
>794±n/a nM
Citation
 Bromidge, SMDavies, SDuckworth, DMForbes, ITJones, GEJones, JKing, FDBlackburn, TPHolland, VKennett, GALightowler, SMiddlemiss, DNRiley, GJTrail, BWood, MD 1-[2-[(Heteroarylmethoxy)aryl]carbamoyl]indolines are selective and orally active 5-HT2C receptor inverse agonists. Bioorg Med Chem Lett 10:1867-70 (2000)  
Target
Name:
5-hydroxytryptamine receptor 2A
Synonyms:
5-HT-2 5-HT2A 5-hydroxytryptamine receptor 2A (5HT-2A) 5HT2A_HUMAN HTR2A | Serotonin receptor 2A
Type:
undefined
Mol. Mass.:
52607.65
Organism:
Homo sapiens (Human)
Description:
P28223
Residue:
471
  
Inhibitor
Name:
BDBM50218203
Synonyms:
CHEMBL301409
Type:
Small organic molecule
Emp. Form.:
C19H17ClN4O2S
Mol. Mass.:
400.882
SMILES:
Cc1cc2CCN(C(=O)Nc3ccc(OCc4nccs4)nc3)c2cc1Cl
: