Target
Beta-1/Beta-2/Beta-3 adrenergic receptor
Ligand
BDBM50218691
Substrate
Meas. Tech.
ChEMBL_39017 (CHEMBL652670)
IC50
4.3±n/a nM
Citation
 Masubuchi, MKawasaki, KEbiike, HIkeda, YTsujii, SSogabe, SFujii, TSakata, KShiratori, YAoki, YOhtsuka, TShimma, N Design and synthesis of novel benzofurans as a new class of antifungal agents targeting fungal N-myristoyltransferase. Part 1. Bioorg Med Chem Lett 11:1833-7 (2001)  
Target
Name:
Beta-1/Beta-2/Beta-3 adrenergic receptor
Synonyms:
Adrenergic receptor beta
Type:
Mol. Mass.:
Description:
ASSAY_ID of ChEMBL is 305577
Components:
This complex has 3 components.
Component 1
Name:
Beta-2 adrenergic receptor
Synonyms:
ADRB2 ADRB2_HUMAN Beta-2 adrenoceptor | Beta-2 adrenoreceptor
Type:
Mol. Mass.:
46461.69
Organism:
Homo sapiens (Human)
Description:
P07550
Residue:
413
  
Component 2
Name:
Beta-1 adrenergic receptor
Synonyms:
ADRB1 ADRB1_HUMAN Beta-1 adrenoceptor | adrenergic Beta1
Type:
G Protein-Coupled Receptor (GPCR)
Mol. Mass.:
51338.40
Organism:
Homo sapiens (Human)
Description:
P08588
Residue:
477
  
Component 3
Name:
Beta-3 adrenergic receptor
Synonyms:
ADRB3 ADRB3_HUMAN Beta-2 adrenergic receptor and beta-3 adrenergic receptor Beta-3 adrenoreceptor | adrenergic Beta3
Type:
G Protein-Coupled Receptor (GPCR)
Mol. Mass.:
43534.88
Organism:
Homo sapiens (Human)
Description:
Residue:
408
  
Inhibitor
Name:
BDBM50218691
Synonyms:
CHEMBL51667
Type:
Small organic molecule
Emp. Form.:
C19H27NO5
Mol. Mass.:
349.4214
SMILES:
CCOC(=O)c1oc2cccc(OCC(O)CNC(C)(C)C)c2c1C
: