Target
Muscarinic acetylcholine receptor M2
Ligand
BDBM81901
Substrate
Meas. Tech.
ChEMBL_139885 (CHEMBL857563)
Ki
6.0±n/a nM
Citation
 Böhme, TMKeim, CDannhardt, GMutschler, ELambrecht, G Design and pharmacology of quinuclidine derivatives as M2-selective muscarinic receptor ligands. Bioorg Med Chem Lett 11:1241-3 (2001)  
Target
Name:
Muscarinic acetylcholine receptor M2
Synonyms:
ACM2_HUMAN Cholinergic, muscarinic M2 Muscarinic acetylcholine receptor M2 and M5 | RecName: Full=Muscarinic acetylcholine receptor M2
Type:
GPCR
Mol. Mass.:
51730.61
Organism:
Homo sapiens (Human)
Description:
P08172
Residue:
466
  
Inhibitor
Name:
BDBM81901
Synonyms:
AF-DX 384 CHEMBL279453 | NSC_119356
Type:
Small organic molecule
Emp. Form.:
C27H38N6O2
Mol. Mass.:
478.6296
SMILES:
CCCN(CCC)CC1CCCCN1CCNC(=O)N1c2ccccc2C(=O)Nc2cccnc12
: