Target
Muscarinic acetylcholine receptor M1
Ligand
BDBM81901
Substrate
Meas. Tech.
ChEMBL_138539 (CHEMBL746257)
Ki
31±n/a nM
Citation
 Böhme, TMKeim, CDannhardt, GMutschler, ELambrecht, G Design and pharmacology of quinuclidine derivatives as M2-selective muscarinic receptor ligands. Bioorg Med Chem Lett 11:1241-3 (2001)  
Target
Name:
Muscarinic acetylcholine receptor M1
Synonyms:
ACM1_HUMAN Cholinergic receptor, muscarinic 1 | Cholinergic, muscarinic M1
Type:
Protein
Mol. Mass.:
51442.54
Organism:
Homo sapiens (Human)
Description:
P11229
Residue:
460
  
Inhibitor
Name:
BDBM81901
Synonyms:
AF-DX 384 CHEMBL279453 | NSC_119356
Type:
Small organic molecule
Emp. Form.:
C27H38N6O2
Mol. Mass.:
478.6296
SMILES:
CCCN(CCC)CC1CCCCN1CCNC(=O)N1c2ccccc2C(=O)Nc2cccnc12
: