Target
D(3) dopamine receptor
Ligand
BDBM50130286
Substrate
Meas. Tech.
ChEMBL_62605 (CHEMBL858401)
Ki
200±n/a nM
Citation
 Bromidge, SMClarke, SEKing, FDLovell, PJNewman, HRiley, GRoutledge, CSerafinowska, HTSmith, DRThomas, DR Bicyclic piperazinylbenzenesulphonamides are potent and selective 5-HT6 receptor antagonists. Bioorg Med Chem Lett 12:1357-60 (2002)  
Target
Name:
D(3) dopamine receptor
Synonyms:
DOPAMINE D3 DRD3_HUMAN Dopamine D3 receptor (D3) Dopamine receptor Dopamine receptor D3
Type:
Mol. Mass.:
44243.43
Organism:
Homo sapiens (Human)
Description:
Residue:
400
  
Inhibitor
Name:
BDBM50130286
Synonyms:
5-Chloro-3-methyl-benzo[b]thiophene-2-sulfonic acid [4-methoxy-3-(4-methyl-piperazin-1-yl)-phenyl]-amide SB-258510
Type:
Small organic molecule
Emp. Form.:
C21H24ClN3O3S2
Mol. Mass.:
466.017
SMILES:
COc1ccc(NS(=O)(=O)c2sc3ccc(Cl)cc3c2C)cc1N1CCN(C)CC1
: