Target
Glycylpeptide N-tetradecanoyltransferase 1/2
Ligand
BDBM50220559
Substrate
Meas. Tech.
ChEMBL_141171 (CHEMBL750521)
IC50
2.0±n/a nM
Citation
 Kawasaki, KMasubuchi, MMorikami, KSogabe, SAoyama, TEbiike, HNiizuma, SHayase, MFujii, TSakata, KShindoh, HShiratori, YAoki, YOhtsuka, TShimma, N Design and synthesis of novel benzofurans as a new class of antifungal agents targeting fungal N-myristoyltransferase. Part 3. Bioorg Med Chem Lett 13:87-91 (2003)  
Target
Name:
Glycylpeptide N-tetradecanoyltransferase 1/2
Synonyms:
Peptide N-myristoyltransferase
Type:
Mol. Mass.:
Description:
ASSAY_ID of ChEMBL is 141178
Components:
This complex has 2 components.
Component 1
Name:
Glycylpeptide N-tetradecanoyltransferase 2
Synonyms:
Glycylpeptide N-tetradecanoyltransferase 2 NMT 2 NMT2_HUMAN Type II N-myristoyltransferase
Type:
PROTEIN
Mol. Mass.:
56986.61
Organism:
Homo sapiens (Human)
Description:
ChEMBL_1435042
Residue:
498
  
Component 2
Name:
Glycylpeptide N-tetradecanoyltransferase 1
Synonyms:
Myristoyl-CoA:protein N-myristoyltransferase (Nmt) NMT NMT1_HUMAN Peptide N-myristoyltransferase 1
Type:
Enzyme
Mol. Mass.:
56814.10
Organism:
Homo sapiens (Human)
Description:
P30419
Residue:
496
  
Inhibitor
Name:
BDBM50220559
Synonyms:
CHEMBL422746
Type:
Small organic molecule
Emp. Form.:
C23H23N3O3S
Mol. Mass.:
421.512
SMILES:
Cc1csc(n1)C(=O)c1oc2cccc(OCCCNCc3cccnc3)c2c1C
: