Target
Alpha-1B adrenergic receptor
Ligand
BDBM50220779
Substrate
Meas. Tech.
ChEMBL_34616 (CHEMBL645574)
Ki
50±n/a nM
Citation
 Lopez, FJArias, LChan, RClarke, DEElworthy, TRFord, APGuzman, AJaime-Figueroa, SJasper, JRMorgans, DJPadilla, FPerez-Medrano, AQuintero, CRomero, MSandoval, LSmith, SAWilliams, TJBlue, DR Synthesis, pharmacology and pharmacokinetics of 3-(4-aryl-piperazin-1-ylalkyl)-uracils as uroselective alpha1A-antagonists. Bioorg Med Chem Lett 13:1873-8 (2003)  
Target
Name:
Alpha-1B adrenergic receptor
Synonyms:
ADA1B_HUMAN Adrenergic alpha1B Adrenergic receptor alpha Alpha 1B-adrenoreceptor | Alpha-1B adrenergic receptor
Type:
Enzyme
Mol. Mass.:
56862.13
Organism:
Homo sapiens (Human)
Description:
P35368
Residue:
520
  
Inhibitor
Name:
BDBM50220779
Synonyms:
CHEMBL298838
Type:
Small organic molecule
Emp. Form.:
C19H21ClF4N4O3
Mol. Mass.:
464.842
SMILES:
Fc1ccc(N2CCN(CCCn3c(=O)[nH]cc(Cl)c3=O)CC2)c(OCC(F)(F)F)c1
: