Target
Alpha-1A adrenergic receptor
Ligand
BDBM50220780
Substrate
Meas. Tech.
ChEMBL_33887 (CHEMBL643759)
Ki
1.3±n/a nM
Citation
 Lopez, FJArias, LChan, RClarke, DEElworthy, TRFord, APGuzman, AJaime-Figueroa, SJasper, JRMorgans, DJPadilla, FPerez-Medrano, AQuintero, CRomero, MSandoval, LSmith, SAWilliams, TJBlue, DR Synthesis, pharmacology and pharmacokinetics of 3-(4-aryl-piperazin-1-ylalkyl)-uracils as uroselective alpha1A-antagonists. Bioorg Med Chem Lett 13:1873-8 (2003)  
Target
Name:
Alpha-1A adrenergic receptor
Synonyms:
ADA1A_HUMAN ADRA1C Alpha 1A-adrenoceptor Alpha adrenergic receptor 1a Alpha-adrenergic receptor 1c adrenergic Alpha1 | adrenergic Alpha1C
Type:
Cell-surface receptors
Mol. Mass.:
51511.67
Organism:
Homo sapiens (Human)
Description:
P35348
Residue:
466
  
Inhibitor
Name:
BDBM50220780
Synonyms:
CHEMBL299452
Type:
Small organic molecule
Emp. Form.:
C19H22F4N4O3
Mol. Mass.:
430.3966
SMILES:
Fc1ccc(N2CCN(CCCn3c(=O)cc[nH]c3=O)CC2)c(OCC(F)(F)F)c1
: