Target
cAMP-specific 3',5'-cyclic phosphodiesterase 4C
Ligand
BDBM50220996
Substrate
Meas. Tech.
ChEMBL_157228 (CHEMBL769552)
IC50
0.580000±n/a nM
Citation
 Kim, EChun, HOJung, SHKim, JHLee, JMSuh, BCXiang, MXRhee, CK Improvement of therapeutic index of phosphodiesterase type IV inhibitors as anti-Asthmatics. Bioorg Med Chem Lett 13:2355-8 (2003)  
Target
Name:
cAMP-specific 3',5'-cyclic phosphodiesterase 4C
Synonyms:
Dpde1 Pde4c
Type:
PROTEIN
Mol. Mass.:
60038.21
Organism:
Rattus norvegicus
Description:
ChEMBL_104732
Residue:
536
  
Inhibitor
Name:
BDBM50220996
Synonyms:
CHEMBL76635
Type:
Small organic molecule
Emp. Form.:
C20H23N3O3
Mol. Mass.:
353.4149
SMILES:
COc1ccc(cc1OC1CCCC1)C(=N\NC(N)=O)\c1ccccc1
: