Target
Corticotropin-releasing factor receptor 1/2
Ligand
BDBM50222122
Substrate
Meas. Tech.
ChEMBL_50962 (CHEMBL666044)
Ki
1.1±n/a nM
Citation
 Arvanitis, AGArnold, CRFitzgerald, LWFrietze, WEOlson, REGilligan, PJRobertson, DW CRF ligands via Suzuki and Negishi couplings of 3-pyridyl boronic acids or halides with 2-benzyloxy-4-chloro-3-nitropyridine. Bioorg Med Chem Lett 13:289-91 (2003)  
Target
Name:
Corticotropin-releasing factor receptor 1/2
Synonyms:
Corticotropin releasing factor receptor
Type:
Mol. Mass.:
Description:
ASSAY_ID of ChEMBL is 217368
Components:
This complex has 2 components.
Component 1
Name:
Corticotropin-releasing factor receptor 1
Synonyms:
CRF-R CRFR1_RAT Corticotropin releasing factor receptor Corticotropin-releasing Factor Receptor 1 Crhr | Crhr1
Type:
G Protein-Coupled Receptor (GPCR)
Mol. Mass.:
47870.75
Organism:
Rattus norvegicus (rat)
Description:
Receptor binding assays were performed using rat cortex homogenate.
Residue:
415
  
Component 2
Name:
Corticotropin-releasing factor receptor 2
Synonyms:
CRF-R-2 CRF2 Beta CRFR2_RAT CRH-R2 Corticotropin-releasing factor receptor 2 Crf2r | Crhr2
Type:
Enzyme Catalytic Domain
Mol. Mass.:
47697.09
Organism:
RAT
Description:
CRF2 Beta 0 RAT::P47866
Residue:
411
  
Inhibitor
Name:
BDBM50222122
Synonyms:
CHEMBL99286
Type:
Small organic molecule
Emp. Form.:
C20H26N4O
Mol. Mass.:
338.4466
SMILES:
CCCC(C)n1c(CC)nc2c(ccnc12)-c1ccc(OC)nc1C
: