Target
Transient receptor potential cation channel subfamily V member 1/2/4
Ligand
BDBM50222641
Substrate
Meas. Tech.
ChEMBL_215627 (CHEMBL818740)
IC50
1.2±n/a nM
Citation
 Park, HGPark, MKChoi, JYChoi, SHLee, JPark, BSKim, MGSuh, YGCho, HOh, ULee, JKim, HDPark, YHKoh, HJLim, KMMoh, JHJew, SS Synthesis of N,N',N"-trisubstituted thiourea derivatives and their antagonist effect on the vanilloid receptor. Bioorg Med Chem Lett 13:601-4 (2003)  
Target
Name:
Transient receptor potential cation channel subfamily V member 1/2/4
Synonyms:
Vanilloid receptor
Type:
Mol. Mass.:
Description:
ASSAY_ID of ChEMBL is 177578
Components:
This complex has 3 components.
Component 1
Name:
Transient receptor potential cation channel subfamily V member 2
Synonyms:
Sac2b Transient receptor potential cation channel subfamily V member 2 Vanilloid receptor | Vrl1
Type:
PROTEIN
Mol. Mass.:
86707.60
Organism:
Rattus norvegicus
Description:
ChEMBL_768011
Residue:
761
  
Component 2
Name:
Transient receptor potential cation channel subfamily V member 1
Synonyms:
Capsaicin receptor TRPV1_RAT Trpv1 Vanilloid VR1 Vanilloid receptor 1 (VRI/TRPV1) Vanilloid receptor type 1-like (TrpV1/Vr1) Vr1l | osm-9-like TRP channel 1
Type:
Transient Receptor
Mol. Mass.:
94956.12
Organism:
Rattus norvegicus (rat)
Description:
O35433
Residue:
838
  
Component 3
Name:
Transient receptor potential cation channel subfamily V member 4
Synonyms:
TRPV4_RAT Vanilloid receptor | Vroac
Type:
PROTEIN
Mol. Mass.:
98016.72
Organism:
Rattus norvegicus
Description:
ChEMBL_1514408
Residue:
871
  
Inhibitor
Name:
BDBM50222641
Synonyms:
CHEMBL157962
Type:
Small organic molecule
Emp. Form.:
C27H31FN2O2S
Mol. Mass.:
466.611
SMILES:
COc1cc(CCCN(CCc2ccc(F)cc2)C(\S)=N\CCc2ccccc2)ccc1O
: