Target
Gamma-secretase subunit APH-1A/Gamma-secretase subunit APH-1B/Gamma-secretase subunit PEN-2/Nicastrin/Presenilin-1/Presenilin-2
Ligand
BDBM50223740
Substrate
Meas. Tech.
ChEMBL_68895 (CHEMBL678617)
IC50
5±n/a nM
Citation
 Ogawa, AMurakami, CKamisuki, SKuriyama, IYoshida, HSugawara, FMizushina, Y Pseudodeflectusin, a novel isochroman derivative from Aspergillus pseudodeflectus a parasite of the sea weed, Sargassum fusiform, as a selective human cancer cytotoxin. Bioorg Med Chem Lett 14:3539-43 (2004)  
Target
Name:
Gamma-secretase subunit APH-1A/Gamma-secretase subunit APH-1B/Gamma-secretase subunit PEN-2/Nicastrin/Presenilin-1/Presenilin-2
Synonyms:
Gamma-Secretase Subunit APH-1A/Gamma-Secretase Subunit PEN-2/Gamma-Secretase Subunit Presenilin-1/Gamma-secretase subunit APH-1B/Nicastrin /Presenilin 2 Gamma-secretase subunit APH-1A/Gamma-secretase subunit APH-1B/Gamma-secretase subunit PEN-2/Nicastrin /Presenilin 1/Presenilin 2
Type:
Mol. Mass.:
Description:
ASSAY_ID of EBI is 68900
Components:
This complex has 6 components.
Component 1
Name:
Gamma-secretase subunit APH-1B
Synonyms:
APH-1b APH1B_HUMAN Gamma-secretase PSFL | Presenilin-stabilization factor-like
Type:
PROTEIN
Mol. Mass.:
28468.17
Organism:
Homo sapiens (Human)
Description:
EBI_10231
Residue:
257
  
Component 2
Name:
Presenilin-2
Synonyms:
AD3LP AD5 Gamma-secretase PS2 PSN2_HUMAN Presenilin 2 Presenilin-2 CTF subunit STM-2 | STM2
Type:
PROTEIN
Mol. Mass.:
50116.65
Organism:
Homo sapiens (Human)
Description:
ChEMBL_855576
Residue:
448
  
Component 3
Name:
Gamma-secretase subunit APH-1A
Synonyms:
APH-1a APH1A_HUMAN Gamma-Secretase Subunit APH-1A Presenilin-stabilization factor
Type:
Enzyme subunit; multi-pass membrane protein
Mol. Mass.:
28998.73
Organism:
Homo sapiens (Human)
Description:
Residue:
265
  
Component 4
Name:
Nicastrin
Synonyms:
Gamma-secretase NCSTN Nicastrin
Type:
PROTEIN
Mol. Mass.:
78404.96
Organism:
Homo sapiens (Human)
Description:
EBI_10683
Residue:
709
  
Component 5
Name:
Presenilin-1
Synonyms:
3.4.23.- Gamma-Secretase Subunit Presenilin-1 PS1 PSEN1 PSNL1 Presenilin-1 CTF12 Protein S182
Type:
Mol. Mass.:
52657.13
Organism:
Homo sapiens (Human)
Description:
P49768
Residue:
467
  
Component 6
Name:
Gamma-secretase subunit PEN-2
Synonyms:
Gamma-Secretase Subunit PEN-2 PEN2 PSENEN | Presenilin enhancer protein 2
Type:
Enzyme subunit; multi-pass membrane protein
Mol. Mass.:
12031.98
Organism:
Homo sapiens (Human)
Description:
Residue:
101
  
Inhibitor
Name:
BDBM50223740
Synonyms:
CHEMBL431679
Type:
Small organic molecule
Emp. Form.:
C24H26F2N4O5
Mol. Mass.:
488.4838
SMILES:
[H][C@@](O)(C(=O)N[C@@H](C)C(=O)NC1c2ccccc2C(=O)N(C(C)C)N(C)C1=O)c1cc(F)cc(F)c1
: