Target
Dihydrofolate reductase
Ligand
BDBM50405963
Substrate
Meas. Tech.
ChEMBL_54733 (CHEMBL668773)
Ki
631±n/a nM
Citation
 Li, RLDietrich, SWHansch, C Quantitative structure-selectivity relationships. Comparison of the inhibition of Escherichia coli and bovine liver dihydrofolate reductase by 5-(substituted-benzyl)-2,4-diaminopyrimidines. J Med Chem 24:538-44 (1981)  
Target
Name:
Dihydrofolate reductase
Synonyms:
Dihydrofolate reductase (F31V) | dfrA17
Type:
Mol. Mass.:
17532.46
Organism:
Escherichia coli
Description:
Residue:
157
  
Inhibitor
Name:
BDBM50405963
Synonyms:
CHEMBL19414
Type:
Small organic molecule
Emp. Form.:
C11H11N5O2
Mol. Mass.:
245.2373
SMILES:
Nc1ncc(Cc2ccc(cc2)[N+]([O-])=O)c(N)n1
: