Target
Dihydrofolate reductase
Ligand
BDBM50405977
Substrate
Meas. Tech.
ChEMBL_53943 (CHEMBL668662)
Ki
537±n/a nM
Citation
 Li, RLDietrich, SWHansch, C Quantitative structure-selectivity relationships. Comparison of the inhibition of Escherichia coli and bovine liver dihydrofolate reductase by 5-(substituted-benzyl)-2,4-diaminopyrimidines. J Med Chem 24:538-44 (1981)  
Target
Name:
Dihydrofolate reductase
Synonyms:
DHFR Dihydrofolate reductase | Dihydrofolate reductase (DHFR)
Type:
Enzyme
Mol. Mass.:
21603.71
Organism:
Bos taurus (Cattle)
Description:
P00376
Residue:
187
  
Inhibitor
Name:
BDBM50405977
Synonyms:
CHEMBL277391
Type:
Small organic molecule
Emp. Form.:
C13H13F3N4O
Mol. Mass.:
298.2637
SMILES:
COc1ccc(Cc2cnc(N)nc2N)cc1C(F)(F)F
: