Target
Dihydrofolate reductase
Ligand
BDBM50405996
Substrate
Meas. Tech.
ChEMBL_54733 (CHEMBL668773)
Ki
59±n/a nM
Citation
 Li, RLDietrich, SWHansch, C Quantitative structure-selectivity relationships. Comparison of the inhibition of Escherichia coli and bovine liver dihydrofolate reductase by 5-(substituted-benzyl)-2,4-diaminopyrimidines. J Med Chem 24:538-44 (1981)  
Target
Name:
Dihydrofolate reductase
Synonyms:
Dihydrofolate reductase (F31V) | dfrA17
Type:
Mol. Mass.:
17532.46
Organism:
Escherichia coli
Description:
Residue:
157
  
Inhibitor
Name:
BDBM50405996
Synonyms:
CHEMBL29712
Type:
Small organic molecule
Emp. Form.:
C11H11IN4
Mol. Mass.:
326.1363
SMILES:
Nc1ncc(Cc2cccc(I)c2)c(N)n1
: