Target
Dihydrofolate reductase
Ligand
BDBM50405987
Substrate
Meas. Tech.
ChEMBL_53931 (CHEMBL669353)
pH
7.2±n/a
Ki
6166±n/a nM
Comments
extracted
Citation
 Li, RHansch, CKaufman, BT A comparison of the inhibitory action of 5-(substituted-benzyl)-2,4-diaminopyrimidines on dihydrofolate reductase from chicken liver with that from bovine liver. J Med Chem 25:435-40 (1982)  
Target
Name:
Dihydrofolate reductase
Synonyms:
DHFR Dihydrofolate reductase | Dihydrofolate reductase (DHFR)
Type:
Enzyme
Mol. Mass.:
21603.71
Organism:
Bos taurus (Cattle)
Description:
P00376
Residue:
187
  
Inhibitor
Name:
BDBM50405987
Synonyms:
CHEMBL19383
Type:
Small organic molecule
Emp. Form.:
C13H17N5
Mol. Mass.:
243.3076
SMILES:
CN(C)c1ccc(Cc2cnc(N)nc2N)cc1
: