Target
Dihydrofolate reductase
Ligand
BDBM50081905
Substrate
Meas. Tech.
ChEMBL_53931 (CHEMBL669353)
pH
7.2±n/a
Ki
331±n/a nM
Comments
extracted
Citation
 Li, RHansch, CKaufman, BT A comparison of the inhibitory action of 5-(substituted-benzyl)-2,4-diaminopyrimidines on dihydrofolate reductase from chicken liver with that from bovine liver. J Med Chem 25:435-40 (1982)  
Target
Name:
Dihydrofolate reductase
Synonyms:
DHFR Dihydrofolate reductase | Dihydrofolate reductase (DHFR)
Type:
Enzyme
Mol. Mass.:
21603.71
Organism:
Bos taurus (Cattle)
Description:
P00376
Residue:
187
  
Inhibitor
Name:
BDBM50081905
Synonyms:
5-(3-Butoxy-benzyl)-pyrimidine-2,4-diamine | CHEMBL31946
Type:
Small organic molecule
Emp. Form.:
C15H20N4O
Mol. Mass.:
272.3455
SMILES:
CCCCOc1cccc(Cc2cnc(N)nc2N)c1
: