Target
Dihydrofolate reductase
Ligand
BDBM50405976
Substrate
Meas. Tech.
ChEMBL_53931 (CHEMBL669353)
pH
7.2±n/a
Ki
1660±n/a nM
Comments
extracted
Citation
 Li, RHansch, CKaufman, BT A comparison of the inhibitory action of 5-(substituted-benzyl)-2,4-diaminopyrimidines on dihydrofolate reductase from chicken liver with that from bovine liver. J Med Chem 25:435-40 (1982)  
Target
Name:
Dihydrofolate reductase
Synonyms:
DHFR Dihydrofolate reductase | Dihydrofolate reductase (DHFR)
Type:
Enzyme
Mol. Mass.:
21603.71
Organism:
Bos taurus (Cattle)
Description:
P00376
Residue:
187
  
Inhibitor
Name:
BDBM50405976
Synonyms:
CHEMBL19790
Type:
Small organic molecule
Emp. Form.:
C12H11F3N4
Mol. Mass.:
268.2377
SMILES:
Nc1ncc(Cc2cccc(c2)C(F)(F)F)c(N)n1
: