Target
Dihydrofolate reductase
Ligand
BDBM77567
Substrate
Meas. Tech.
ChEMBL_53931 (CHEMBL669353)
pH
7.2±n/a
Ki
1820±n/a nM
Comments
extracted
Citation
 Li, RHansch, CKaufman, BT A comparison of the inhibitory action of 5-(substituted-benzyl)-2,4-diaminopyrimidines on dihydrofolate reductase from chicken liver with that from bovine liver. J Med Chem 25:435-40 (1982)  
Target
Name:
Dihydrofolate reductase
Synonyms:
DHFR Dihydrofolate reductase | Dihydrofolate reductase (DHFR)
Type:
Enzyme
Mol. Mass.:
21603.71
Organism:
Bos taurus (Cattle)
Description:
P00376
Residue:
187
  
Inhibitor
Name:
BDBM77567
Synonyms:
5-(4-Butoxy-benzyl)-pyrimidine-2,4-diamine MLS001049199 [2-amino-5-(4-butoxybenzyl)pyrimidin-4-yl]amine | cid_623352
Type:
Small organic molecule
Emp. Form.:
C15H20N4O
Mol. Mass.:
272.3455
SMILES:
CCCCOc1ccc(Cc2cnc(N)nc2N)cc1
: