Target
Dihydrofolate reductase
Ligand
BDBM50138691
Substrate
Meas. Tech.
ChEMBL_54732 (CHEMBL668772)
Ki
19±n/a nM
Citation
 Hansch, CLi, RBlaney, JMLangridge, R Comparison of the inhibition of Escherichia coli and Lactobacillus casei dihydrofolate reductase by 2,4-diamino-5-(substituted-benzyl)pyrimidines: quantitative structure-activity relationships, X-ray crystallography, and computer graphics in structure-activity analysis. J Med Chem 25:777-84 (1982)  
Target
Name:
Dihydrofolate reductase
Synonyms:
Dihydrofolate reductase (F31V) | dfrA17
Type:
Mol. Mass.:
17532.46
Organism:
Escherichia coli
Description:
Residue:
157
  
Inhibitor
Name:
BDBM50138691
Synonyms:
5-(3,4-Dimethoxy-benzyl)-pyrimidine-2,4-diamine Diaveridine
Type:
Small organic molecule
Emp. Form.:
C13H16N4O2
Mol. Mass.:
260.2917
SMILES:
COc1ccc(Cc2cnc(N)nc2N)cc1OC
: