Target
Dihydrofolate reductase
Ligand
BDBM50405970
Substrate
Meas. Tech.
ChEMBL_54732 (CHEMBL668772)
Ki
447±n/a nM
Citation
 Hansch, CLi, RBlaney, JMLangridge, R Comparison of the inhibition of Escherichia coli and Lactobacillus casei dihydrofolate reductase by 2,4-diamino-5-(substituted-benzyl)pyrimidines: quantitative structure-activity relationships, X-ray crystallography, and computer graphics in structure-activity analysis. J Med Chem 25:777-84 (1982)  
Target
Name:
Dihydrofolate reductase
Synonyms:
Dihydrofolate reductase (F31V) | dfrA17
Type:
Mol. Mass.:
17532.46
Organism:
Escherichia coli
Description:
Residue:
157
  
Inhibitor
Name:
BDBM50405970
Synonyms:
CHEMBL19780
Type:
Small organic molecule
Emp. Form.:
C11H11FN4
Mol. Mass.:
218.2302
SMILES:
Nc1ncc(Cc2ccc(F)cc2)c(N)n1
: