Target
Dihydrofolate reductase
Ligand
BDBM50081919
Substrate
Meas. Tech.
ChEMBL_55072 (CHEMBL858271)
Ki
1514±n/a nM
Citation
 Hansch, CLi, RBlaney, JMLangridge, R Comparison of the inhibition of Escherichia coli and Lactobacillus casei dihydrofolate reductase by 2,4-diamino-5-(substituted-benzyl)pyrimidines: quantitative structure-activity relationships, X-ray crystallography, and computer graphics in structure-activity analysis. J Med Chem 25:777-84 (1982)  
Target
Name:
Dihydrofolate reductase
Synonyms:
DYR_LACCA folA
Type:
PROTEIN
Mol. Mass.:
18437.08
Organism:
Lactobacillus casei
Description:
ChEMBL_1357878
Residue:
163
  
Inhibitor
Name:
BDBM50081919
Synonyms:
3-(2,4-Diamino-pyrimidin-5-ylmethyl)-phenol | CHEMBL30734
Type:
Small organic molecule
Emp. Form.:
C11H12N4O
Mol. Mass.:
216.2392
SMILES:
Nc1ncc(Cc2cccc(O)c2)c(N)n1
: