Target
Dihydrofolate reductase
Ligand
BDBM77567
Substrate
Meas. Tech.
ChEMBL_55072 (CHEMBL858271)
Ki
427±n/a nM
Citation
 Hansch, CLi, RBlaney, JMLangridge, R Comparison of the inhibition of Escherichia coli and Lactobacillus casei dihydrofolate reductase by 2,4-diamino-5-(substituted-benzyl)pyrimidines: quantitative structure-activity relationships, X-ray crystallography, and computer graphics in structure-activity analysis. J Med Chem 25:777-84 (1982)  
Target
Name:
Dihydrofolate reductase
Synonyms:
DYR_LACCA folA
Type:
PROTEIN
Mol. Mass.:
18437.08
Organism:
Lactobacillus casei
Description:
ChEMBL_1357878
Residue:
163
  
Inhibitor
Name:
BDBM77567
Synonyms:
5-(4-Butoxy-benzyl)-pyrimidine-2,4-diamine MLS001049199 [2-amino-5-(4-butoxybenzyl)pyrimidin-4-yl]amine | cid_623352
Type:
Small organic molecule
Emp. Form.:
C15H20N4O
Mol. Mass.:
272.3455
SMILES:
CCCCOc1ccc(Cc2cnc(N)nc2N)cc1
: