Target
Dihydrofolate reductase
Ligand
BDBM50138707
Substrate
Meas. Tech.
ChEMBL_54732 (CHEMBL668772)
Ki
151±n/a nM
Citation
 Hansch, CLi, RBlaney, JMLangridge, R Comparison of the inhibition of Escherichia coli and Lactobacillus casei dihydrofolate reductase by 2,4-diamino-5-(substituted-benzyl)pyrimidines: quantitative structure-activity relationships, X-ray crystallography, and computer graphics in structure-activity analysis. J Med Chem 25:777-84 (1982)  
Target
Name:
Dihydrofolate reductase
Synonyms:
Dihydrofolate reductase (F31V) | dfrA17
Type:
Mol. Mass.:
17532.46
Organism:
Escherichia coli
Description:
Residue:
157
  
Inhibitor
Name:
BDBM50138707
Synonyms:
5-(4-Methoxy-benzyl)-pyrimidine-2,4-diamine | CHEMBL19023
Type:
Small organic molecule
Emp. Form.:
C12H14N4O
Mol. Mass.:
230.2658
SMILES:
COc1ccc(Cc2cnc(N)nc2N)cc1
: