Target
Alpha-2A/Alpha-2B/Alpha-2C adrenergic receptor
Ligand
BDBM34572
Substrate
Meas. Tech.
ChEMBL_33317 (CHEMBL645613)
IC50
3.0±n/a nM
Citation
 Van Dort, MNeubig, RCounsell, RE Radioiodinated p-iodoclonidine: a high-affinity probe for the alpha 2-adrenergic receptor. J Med Chem 30:1241-4 (1987)  
Target
Name:
Alpha-2A/Alpha-2B/Alpha-2C adrenergic receptor
Synonyms:
Adrenergic Receptors (alpha 2) | Adrenergic receptor alpha-2
Type:
Mol. Mass.:
Description:
ASSAY_ID of ChEMBL is 305672
Components:
This complex has 3 components.
Component 1
Name:
Alpha-2B adrenergic receptor
Synonyms:
ADA2B_HUMAN ADRA2L1 Adrenergic alpha2B Adrenergic receptor alpha Alpha-2 adrenergic receptor subtype C2 Alpha-2B adrenoreceptor | Alpha-2BAR
Type:
Enzyme
Mol. Mass.:
49964.20
Organism:
Homo sapiens (Human)
Description:
P18089
Residue:
450
  
Component 2
Name:
Alpha-2A adrenergic receptor
Synonyms:
ADA2A_HUMAN ADRA2R Adrenergic alpha2A Alpha-2 adrenergic receptor subtype C10 Alpha-2A adrenoreceptor alpha-2A adrenergic receptor [Homo sapiens]
Type:
Enzyme
Mol. Mass.:
48979.91
Organism:
Homo sapiens (Human)
Description:
P08913
Residue:
450
  
Component 3
Name:
Alpha-2C adrenergic receptor
Synonyms:
ADA2C_HUMAN ADRA2L2 Adrenergic alpha2C Adrenergic receptor alpha Alpha-2 adrenergic receptor subtype C4 Alpha-2C adrenoreceptor | adrenergic, alpha-2C-, receptor [Homo sapiens]
Type:
Enzyme
Mol. Mass.:
49552.32
Organism:
Homo sapiens (Human)
Description:
P18825
Residue:
462
  
Inhibitor
Name:
BDBM34572
Synonyms:
BRIMONIDINE MLS000069370 UK 14,304 | cid_2435
Type:
Small organic molecule
Emp. Form.:
C11H10BrN5
Mol. Mass.:
292.135
SMILES:
Brc1c(NC2=NCCN2)ccc2nccnc12
: