Target
S-adenosylmethionine synthase isoform type-1/type-2
Ligand
BDBM50226768
Substrate
Meas. Tech.
ChEMBL_104812 (CHEMBL709696)
Ki
360±n/a nM
Citation
 Kappler, FVrudhula, VMHampton, A Toward the synthesis of isozyme-specific enzyme inhibitors. Potent inhibitors of rat methionine adenosyltransferases. Effect of one-atom elongation of the ribose-P alpha bridge in two covalent adducts of L-methionine and beta,gamma-imido-ATP. J Med Chem 31:384-9 (1988)  
Target
Name:
S-adenosylmethionine synthase isoform type-1/type-2
Synonyms:
S-adenosylmethionine synthetase (MAT 1 and MAT 2)
Type:
Mol. Mass.:
Description:
ASSAY_ID of ChEMBL is 104961
Components:
This complex has 2 components.
Component 1
Name:
S-adenosylmethionine synthase isoform type-1
Synonyms:
AdoMet synthetase 1 MAT 1 METK1_RAT Methionine adenosyltransferase 1 S-adenosylmethionine synthetase (MAT 1 and MAT 2) S-adenosylmethionine synthetase isoform type-1
Type:
PROTEIN
Mol. Mass.:
43692.87
Organism:
Rattus norvegicus
Description:
ChEMBL_11027
Residue:
397
  
Component 2
Name:
S-adenosylmethionine synthase isoform type-2
Synonyms:
AdoMet synthetase 2 MAT 2 METK2_RAT Methionine adenosyltransferase 2 S-Adenosylmethionine Synthase (AdoMet) S-adenosylmethionine synthetase gamma form | S-adenosylmethionine synthetase isoform type-2
Type:
PROTEIN
Mol. Mass.:
43713.68
Organism:
Rattus norvegicus
Description:
ChEMBL_105118
Residue:
395
  
Inhibitor
Name:
BDBM50226768
Synonyms:
CHEMBL1791426
Type:
Small organic molecule
Emp. Form.:
C15H26N7O14P3S
Mol. Mass.:
653.392
SMILES:
[H][C@](CNP(O)(=O)OP(O)(=O)OP(O)(O)=O)(SCCC(N)C(O)=O)[C@@]1([H])O[C@H]([C@H](O)[C@@H]1O)n1cnc2c(N)ncnc12
: