Target
Dihydrofolate reductase
Ligand
BDBM50138707
Substrate
Meas. Tech.
ChEMBL_54735 (CHEMBL667186)
Ki
151±n/a nM
Citation
 Doweyko, AM The hypothetical active site lattice. An approach to modelling active sites from data on inhibitor molecules. J Med Chem 31:1396-406 (1988)  
Target
Name:
Dihydrofolate reductase
Synonyms:
Dihydrofolate reductase (F31V) | dfrA17
Type:
Mol. Mass.:
17532.46
Organism:
Escherichia coli
Description:
Residue:
157
  
Inhibitor
Name:
BDBM50138707
Synonyms:
5-(4-Methoxy-benzyl)-pyrimidine-2,4-diamine | CHEMBL19023
Type:
Small organic molecule
Emp. Form.:
C12H14N4O
Mol. Mass.:
230.2658
SMILES:
COc1ccc(Cc2cnc(N)nc2N)cc1
: