Target
Dihydrofolate reductase
Ligand
BDBM50405960
Substrate
Meas. Tech.
ChEMBL_54735 (CHEMBL667186)
Ki
199±n/a nM
Citation
 Doweyko, AM The hypothetical active site lattice. An approach to modelling active sites from data on inhibitor molecules. J Med Chem 31:1396-406 (1988)  
Target
Name:
Dihydrofolate reductase
Synonyms:
Dihydrofolate reductase (F31V) | dfrA17
Type:
Mol. Mass.:
17532.46
Organism:
Escherichia coli
Description:
Residue:
157
  
Inhibitor
Name:
BDBM50405960
Synonyms:
CHEMBL19406
Type:
Small organic molecule
Emp. Form.:
C12H14N4
Mol. Mass.:
214.2664
SMILES:
Cc1cccc(Cc2cnc(N)nc2N)c1
: