Target
DNA topoisomerase 2-beta
Ligand
BDBM21690
Substrate
Meas. Tech.
ChEMBL_75870 (CHEMBL687257)
IC50
905±n/a nM
Citation
 Wentland, MPPerni, RBDorff, PHRake, JB Synthesis and bacterial DNA gyrase inhibitory properties of a spirocyclopropylquinolone derivative. J Med Chem 31:1694-7 (1988)  
Target
Name:
DNA topoisomerase 2-beta
Synonyms:
DNA topoisomerase II TOP2B | TOP2B_HUMAN
Type:
PROTEIN
Mol. Mass.:
183284.13
Organism:
Homo sapiens (Human)
Description:
ChEMBL_51583
Residue:
1626
  
Inhibitor
Name:
BDBM21690
Synonyms:
1-cyclopropyl-6-fluoro-4-oxo-7-(piperazin-1-yl)-1,4-dihydroquinoline-3-carboxylic acid Bay 09867 Ciprinol Ciprofloxacin US9138393, Ciprofloxacin HCl | US9144538, Ciprofloxacin HCl
Type:
Small organic molecule
Emp. Form.:
C17H18FN3O3
Mol. Mass.:
331.3415
SMILES:
OC(=O)c1cn(C2CC2)c2cc(N3CCNCC3)c(F)cc2c1=O
: