Target
Sterol O-acyltransferase 1
Ligand
BDBM50227907
Substrate
Meas. Tech.
ChEMBL_28499 (CHEMBL645929)
IC50
1440±n/a nM
Citation
 DeVries, VGBloom, JDDutia, MDKatocs, ASLargis, EE Potential antiatherosclerotic agents. 6. Hypocholesterolemic trisubstituted urea analogues. J Med Chem 32:2318-25 (1989)  
Target
Name:
Sterol O-acyltransferase 1
Synonyms:
ACAT-1 Acat SOAT1_RAT Sterol O-acyltransferase, Soat
Type:
PROTEIN
Mol. Mass.:
64165.56
Organism:
Rattus norvegicus
Description:
ChEMBL_28796
Residue:
545
  
Inhibitor
Name:
BDBM50227907
Synonyms:
CHEMBL441803
Type:
Small organic molecule
Emp. Form.:
C22H32N2OS
Mol. Mass.:
372.567
SMILES:
CCCCCCCN(Cc1cccs1)C(=O)Nc1cc(C)c(C)cc1C
: