Target
Sterol O-acyltransferase 1
Ligand
BDBM50227908
Substrate
Meas. Tech.
ChEMBL_28019 (CHEMBL641218)
IC50
311±n/a nM
Citation
 DeVries, VGBloom, JDDutia, MDKatocs, ASLargis, EE Potential antiatherosclerotic agents. 6. Hypocholesterolemic trisubstituted urea analogues. J Med Chem 32:2318-25 (1989)  
Target
Name:
Sterol O-acyltransferase 1
Synonyms:
ACACT ACAT Acetyl-CoA acetyltransferase, mitochondrial Acyl-CoA: cholesterol acyltransferase (ACAT) Cholesterol acyltransferase 1 SOAT1 STAT
Type:
Multi-pass membrane protein may form homo- or heterodimers.
Mol. Mass.:
64751.94
Organism:
Homo sapiens (Human)
Description:
P35610
Residue:
550
  
Inhibitor
Name:
BDBM50227908
Synonyms:
CHEMBL77988
Type:
Small organic molecule
Emp. Form.:
C19H23Cl3N2O2
Mol. Mass.:
417.757
SMILES:
CCCCCCCN(Cc1ccco1)C(=O)Nc1c(Cl)cc(Cl)cc1Cl
: