Target
Sterol O-acyltransferase 1
Ligand
BDBM50227948
Substrate
Meas. Tech.
ChEMBL_28503 (CHEMBL645932)
IC50
3180±n/a nM
Citation
 DeVries, VGBloom, JDDutia, MDKatocs, ASLargis, EE Potential antiatherosclerotic agents. 6. Hypocholesterolemic trisubstituted urea analogues. J Med Chem 32:2318-25 (1989)  
Target
Name:
Sterol O-acyltransferase 1
Synonyms:
ACAT-1 Acat SOAT1_RAT Sterol O-acyltransferase, Soat
Type:
PROTEIN
Mol. Mass.:
64165.56
Organism:
Rattus norvegicus
Description:
ChEMBL_28796
Residue:
545
  
Inhibitor
Name:
BDBM50227948
Synonyms:
CHEMBL75596
Type:
Small organic molecule
Emp. Form.:
C27H24N2O2
Mol. Mass.:
408.4917
SMILES:
O=C(Nc1ccc(Oc2ccccc2)cc1)N(Cc1ccccc1)Cc1ccccc1
: