Target
Voltage-dependent L-type calcium channel subunit alpha-1S
Ligand
BDBM50227969
Substrate
Meas. Tech.
ChEMBL_214797 (CHEMBL815533)
IC50
8.7±n/a nM
Citation
 Cho, HUeda, MShima, KMizuno, AHayashimatsu, MOhnaka, YTakeuchi, YHamaguchi, MAisaka, KHidaka, T Dihydropyrimidines: novel calcium antagonists with potent and long-lasting vasodilative and antihypertensive activity. J Med Chem 32:2399-406 (1989)  
Target
Name:
Voltage-dependent L-type calcium channel subunit alpha-1S
Synonyms:
CAC1S_RAT Cacn1 Cacnl1a3 Cchl1a3 Voltage-gated L-type calcium channel Voltage-gated calcium channel subunit alpha Cav1.1
Type:
PROTEIN
Mol. Mass.:
210392.58
Organism:
Rattus norvegicus
Description:
ChEMBL_92777
Residue:
1850
  
Inhibitor
Name:
BDBM50227969
Synonyms:
CHEMBL312176 | CV-4093
Type:
Small organic molecule
Emp. Form.:
C35H38N4O6
Mol. Mass.:
610.6994
SMILES:
CO\C(O)=C1/C(C(C(=O)OCCN2CCN(CC2)C(c2ccccc2)c2ccccc2)=C(C)N=C1C)c1cccc(c1)[N+]([O-])=O
: