Target
S-adenosylmethionine synthase isoform type-1/type-2
Ligand
BDBM50228186
Substrate
Meas. Tech.
ChEMBL_104794 (CHEMBL713568)
Ki
110±n/a nM
Citation
 Vrudhula, VMKappler, FAfshar, CGinell, SLLessinger, LHampton, A Approaches to isozyme-specific inhibitors. 16. A novel methyl-C5' covalent adduct of L-ethionine and beta,gamma-imido-ATP as a potent multisubstrate inhibitor of rat methionine adenosyltransferases. J Med Chem 32:885-90 (1989)  
Target
Name:
S-adenosylmethionine synthase isoform type-1/type-2
Synonyms:
S-adenosylmethionine synthetase (MAT 1 and MAT 2)
Type:
Mol. Mass.:
Description:
ASSAY_ID of ChEMBL is 104961
Components:
This complex has 2 components.
Component 1
Name:
S-adenosylmethionine synthase isoform type-1
Synonyms:
AdoMet synthetase 1 MAT 1 METK1_RAT Methionine adenosyltransferase 1 S-adenosylmethionine synthetase (MAT 1 and MAT 2) S-adenosylmethionine synthetase isoform type-1
Type:
PROTEIN
Mol. Mass.:
43692.87
Organism:
Rattus norvegicus
Description:
ChEMBL_11027
Residue:
397
  
Component 2
Name:
S-adenosylmethionine synthase isoform type-2
Synonyms:
AdoMet synthetase 2 MAT 2 METK2_RAT Methionine adenosyltransferase 2 S-Adenosylmethionine Synthase (AdoMet) S-adenosylmethionine synthetase gamma form | S-adenosylmethionine synthetase isoform type-2
Type:
PROTEIN
Mol. Mass.:
43713.68
Organism:
Rattus norvegicus
Description:
ChEMBL_105118
Residue:
395
  
Inhibitor
Name:
BDBM50228186
Synonyms:
CHEMBL3706404
Type:
Small organic molecule
Emp. Form.:
C16H28N7O14P3S
Mol. Mass.:
667.418
SMILES:
[H][C@@]1(O[C@H]([C@H](O)[C@@H]1O)n1cnc2c(N)ncnc12)[C@@H](CCSCCC(N)C(O)=O)OP(O)(=O)OP(O)(=O)NP(O)(O)=O
: