Target
cAMP-specific 3',5'-cyclic phosphodiesterase 4C
Ligand
BDBM50228822
Substrate
Meas. Tech.
ChEMBL_157219 (CHEMBL769543)
IC50
290±n/a nM
Citation
 Saccomano, NAVinick, FJKoe, BKNielsen, JAWhalen, WMMeltz, MPhillips, DThadieo, PFJung, SChapin, DS Calcium-independent phosphodiesterase inhibitors as putative antidepressants: [3-(bicycloalkyloxy)-4-methoxyphenyl]-2-imidazolidinones. J Med Chem 34:291-8 (1991)  
Target
Name:
cAMP-specific 3',5'-cyclic phosphodiesterase 4C
Synonyms:
Dpde1 Pde4c
Type:
PROTEIN
Mol. Mass.:
60038.21
Organism:
Rattus norvegicus
Description:
ChEMBL_104732
Residue:
536
  
Inhibitor
Name:
BDBM50228822
Synonyms:
CHEMBL2112410
Type:
Small organic molecule
Emp. Form.:
C22H24N2O3
Mol. Mass.:
364.4376
SMILES:
COc1ccc(cc1O[C@@H]1CC2CC1c1ccccc21)C1CNC(=O)N1C
: