Target
cAMP-dependent protein kinase catalytic subunit gamma
Ligand
BDBM50011236
Substrate
Meas. Tech.
ChEMBL_161403 (CHEMBL768312)
IC50
2000±n/a nM
Citation
 Ricouart, AGesquiere, JCTartar, ASergheraert, C Design of potent protein kinase inhibitors using the bisubstrate approach. J Med Chem 34:73-8 (1991)  
Target
Name:
cAMP-dependent protein kinase catalytic subunit gamma
Synonyms:
KAPCG_HUMAN PRKACG cAMP-dependent protein kinase catalytic subunit gamma
Type:
PROTEIN
Mol. Mass.:
40442.03
Organism:
Homo sapiens (Human)
Description:
ChEMBL_104720
Residue:
351
  
Inhibitor
Name:
BDBM50011236
Synonyms:
CHEMBL344314 Isoquinolinesulfonamide, H-9 | N-(2-aminoethyl)isoquinoline-5-sulfonamide
Type:
Small organic molecule
Emp. Form.:
C11H13N3O2S
Mol. Mass.:
251.305
SMILES:
NCCNS(=O)(=O)c1cccc2cnccc12
: