Target
Cannabinoid receptor 1/2
Ligand
BDBM50229031
Substrate
Meas. Tech.
ChEMBL_46146 (CHEMBL660019)
IC50
334±n/a nM
Citation
 Compton, DRPrescott, WRMartin, BRSiegel, CGordon, PMRazdan, RK Synthesis and pharmacological evaluation of ether and related analogues of delta 8-, delta 9-, and delta 9,11-tetrahydrocannabinol. J Med Chem 34:3310-6 (1991)  
Target
Name:
Cannabinoid receptor 1/2
Synonyms:
Cannabinoid receptor
Type:
Mol. Mass.:
Description:
ASSAY_ID of ChEMBL is 1859866
Components:
This complex has 2 components.
Component 1
Name:
Cannabinoid receptor 2
Synonyms:
CANNABINOID CB2 CB2 Cannabinoid CB2 receptor Cnr2 | rCB2
Type:
Enzyme
Mol. Mass.:
39366.68
Organism:
Rattus norvegicus (Rat)
Description:
Q9QZN9
Residue:
360
  
Component 2
Name:
Cannabinoid receptor 1
Synonyms:
Brain-type cannabinoid receptor CB-R CNR1_RAT Cannabinoid receptor Cnr1 | Skr6
Type:
G Protein-Coupled Receptor (GPCR)
Mol. Mass.:
52856.55
Organism:
Rattus norvegicus (rat)
Description:
P20272
Residue:
473
  
Inhibitor
Name:
BDBM50229031
Synonyms:
CHEMBL112253
Type:
Small organic molecule
Emp. Form.:
C21H30O2
Mol. Mass.:
314.4617
SMILES:
[H][C@@]12CC(=C)CC[C@@]1([H])C(C)(C)Oc1cc(CCCCC)cc(O)c21
: