Target
Voltage-dependent L-type calcium channel subunit alpha-1S
Ligand
BDBM50229245
Substrate
Meas. Tech.
ChEMBL_53177 (CHEMBL664572)
IC50
2800±n/a nM
Citation
 Sircar, IGregor, EKAnderson, KRHaleen, SJShih, YHWeishaar, RESteffen, RPPugsley, TATaylor, MD Calcium channel blocking and positive inotropic activities of ethyl 5-cyano-1,4-dihydro-6-methyl-2-[(phenylsulfonyl)methyl]-4-aryl-3- pyridine-carboxylate and analogues. Synthesis and structure-activity relationships. J Med Chem 34:2248-60 (1991)  
Target
Name:
Voltage-dependent L-type calcium channel subunit alpha-1S
Synonyms:
CAC1S_RAT Cacn1 Cacnl1a3 Cchl1a3 Voltage-gated L-type calcium channel Voltage-gated calcium channel subunit alpha Cav1.1
Type:
PROTEIN
Mol. Mass.:
210392.58
Organism:
Rattus norvegicus
Description:
ChEMBL_92777
Residue:
1850
  
Inhibitor
Name:
BDBM50229245
Synonyms:
CHEMBL2115150
Type:
Small organic molecule
Emp. Form.:
C24H21F3N2O3S
Mol. Mass.:
474.495
SMILES:
CCOC(=O)C1=C(C[S+]([O-])c2ccccc2)NC(C)=C(C#N)C1c1ccccc1C(F)(F)F
: