Target
Carbonic anhydrase 6
Ligand
BDBM50230217
Substrate
Meas. Tech.
ChEMBL_47171 (CHEMBL877290)
IC50
50±n/a nM
Citation
 Lo, YSNolan, JCMaren, THWelstead, WJGripshover, DFShamblee, DA Synthesis and physicochemical properties of sulfamate derivatives as topical antiglaucoma agents. J Med Chem 35:4790-4 (1992)  
Target
Name:
Carbonic anhydrase 6
Synonyms:
CA-VI CAH6_BOVIN Carbonic anhydrase 6 Salivary carbonic anhydrase | Secreted carbonic anhydrase
Type:
PROTEIN
Mol. Mass.:
37008.14
Organism:
Bos taurus
Description:
ChEMBL_104851
Residue:
319
  
Inhibitor
Name:
BDBM50230217
Synonyms:
CHEMBL555867
Type:
Small organic molecule
Emp. Form.:
C10H12ClN3O3S
Mol. Mass.:
289.739
SMILES:
Cl.Cc1nccn1-c1cccc(OS(N)(=O)=O)c1
: