Target
Type-1/Type-2 angiotensin II receptor
Ligand
BDBM50230440
Substrate
Meas. Tech.
ChEMBL_36174 (CHEMBL646986)
IC50
3900±n/a nM
Citation
 Thomas, APAllott, CPGibson, KHMajor, JSMasek, BBOldham, AARatcliffe, AHRoberts, DARussell, STThomason, DA New nonpeptide angiotensin II receptor antagonists. 1. Synthesis, biological properties, and structure-activity relationships of 2-alkyl benzimidazole derivatives. J Med Chem 35:877-85 (1992)  
Target
Name:
Type-1/Type-2 angiotensin II receptor
Synonyms:
Angiotensin II receptor
Type:
Mol. Mass.:
Description:
ASSAY_ID of ChEMBL is 357784
Components:
This complex has 2 components.
Component 1
Name:
Type-1 angiotensin II receptor
Synonyms:
AGTR1 AGTR1B AT1 AT1BR AT2R1B Angiotensin II receptor Type-1 angiotensin II receptor (AT1)
Type:
Protein
Mol. Mass.:
41080.75
Organism:
Homo sapiens (Human)
Description:
P30556
Residue:
359
  
Component 2
Name:
Type-2 angiotensin II receptor
Synonyms:
AGTR2 AT2 Angiotensin II type 2 (AT-2) receptor Type-2 angiotensin II receptor
Type:
Enzyme Catalytic Domain
Mol. Mass.:
41201.61
Organism:
Homo sapiens (Human)
Description:
Angiotensin II, central 0 0::P50052
Residue:
363
  
Inhibitor
Name:
BDBM50230440
Synonyms:
CHEMBL171395
Type:
Small organic molecule
Emp. Form.:
C19H19BrN2O2
Mol. Mass.:
387.27
SMILES:
CCCCc1nc2ccccc2n1Cc1ccc(C(O)=O)c(Br)c1
: