Target
Estrogen receptor beta
Ligand
BDBM50230560
Substrate
Meas. Tech.
ChEMBL_65915 (CHEMBL677161)
IC50
125±n/a nM
Citation
 Jones, CDBlaszczak, LCGoettel, MESuarez, TCrowell, TAMabry, TERuenitz, PCSrivatsan, V Antiestrogens. 3. Estrogen receptor affinities and antiproliferative effects in MCF-7 cells of phenolic analogues of trioxifene, [3,4-dihydro-2-(4- methoxyphenyl)-1-naphthalenyl][4-[2-(1-pyrrolidinyl)ethoxy]- phenyl]methanone. J Med Chem 35:931-8 (1992)  
Target
Name:
Estrogen receptor beta
Synonyms:
Estrogen receptor
Type:
Mol. Mass.:
Description:
ASSAY_ID of ChEMBL is 99778
Components:
This complex has 2 components.
Component 1
Name:
Estrogen receptor beta
Synonyms:
ER-beta ESR2_HUMAN Estradiol receptor beta (ERβ) Estrogen receptor (ER beta) Estrogen receptor beta (ER beta) NR3A2 estrogen beta
Type:
Protein
Mol. Mass.:
59238.43
Organism:
Homo sapiens (Human)
Description:
Q92731
Residue:
530
  
Component 2
Name:
Estrogen receptor
Synonyms:
ER ESR ESR1_HUMAN Estrogen receptor Estrogen receptor (ER-alpha) Estrogen receptor alpha (ER) Nuclear receptor subfamily 3 group A member 1
Type:
Protein
Mol. Mass.:
66230.44
Organism:
Homo sapiens (Human)
Description:
P03372
Residue:
595
  
Inhibitor
Name:
BDBM50230560
Synonyms:
CHEMBL2112950
Type:
Small organic molecule
Emp. Form.:
C30H29NO3
Mol. Mass.:
451.5562
SMILES:
Oc1ccc-2c(c1)C(c1c-2ccc2cc(O)ccc12)c1ccc(OCCN2CCCCC2)cc1
: