Target
Similar to alpha-tubulin isoform 1
Ligand
BDBM50005480
Substrate
Meas. Tech.
ChEMBL_211320 (CHEMBL818979)
IC50
1100±n/a nM
Citation
 Getahun, ZJurd, LChu, PSLin, CMHamel, E Synthesis of alkoxy-substituted diaryl compounds and correlation of ring separation with inhibition of tubulin polymerization: differential enhancement of inhibitory effects under suboptimal polymerization reaction conditions. J Med Chem 35:1058-67 (1992)  
Target
Name:
Similar to alpha-tubulin isoform 1
Synonyms:
Similar to alpha-tubulin isoform 1
Type:
PROTEIN
Mol. Mass.:
10383.05
Organism:
Bos taurus
Description:
ChEMBL_104716
Residue:
99
  
Inhibitor
Name:
BDBM50005480
Synonyms:
(-)-combretastatin (Z)-5-(3,4,5-trimethoxystyryl)-2-methoxyphenol (combretastin A-4)2-Methoxy-5-[2-(3,4,5-trimethoxy-phenyl)-vinyl]-phenol 2-Methoxy-5-[(Z)-2-(3,4,5-trimethoxy-phenyl)-vinyl]-phenol 2-methoxy-5-(3,4,5-trimethoxystyryl)phenol 5-(3,4,5-trimethoxystyryl)-2-methoxyphenol CHEMBL67 Combrestatin A4 Combretastatin Combretastin A-4 combretastatin A-4, (CSA4) | combretastin A4
Type:
Small organic molecule
Emp. Form.:
C18H20O5
Mol. Mass.:
316.3484
SMILES:
COc1ccc(\C=C/c2cc(OC)c(OC)c(OC)c2)cc1O
: