Target
Protein kinase C zeta type
Ligand
BDBM50230709
Substrate
Meas. Tech.
ChEMBL_152965 (CHEMBL760358)
IC50
3900±n/a nM
Citation
 Kumaravel, GAshendel, CLGandour, RD Hemicholinium and related lipids: inhibitors of protein kinase C. J Med Chem 36:177-8 (1993)  
Target
Name:
Protein kinase C zeta type
Synonyms:
KPCZ_RAT Prkcz Protein kinase C zeta type | nPKC-zeta
Type:
PROTEIN
Mol. Mass.:
67722.31
Organism:
Rattus norvegicus
Description:
ChEMBL_104731
Residue:
592
  
Inhibitor
Name:
BDBM50230709
Synonyms:
CHEMBL295954
Type:
Small organic molecule
Emp. Form.:
C22H46BrNO2
Mol. Mass.:
436.51
SMILES:
[Br-].CCCCCCCCCCCCCCCC1(C[N+](C)(C)CCO1)OC
: